{"text_format":"1","workbook":"xlsx","n_sheets":8,"sheets":["INSTRUCTIONS","Section A-CC & Settings by Age","Section B-CC & Settings by RE","Section C-Child Count by Gender","Section D-At Risk Child Count","Section E-Cumulative CC","Year-to-Year Change","Failed Edit Checks and Warnings"],"not_rendered":{"charts":0,"images":4,"macros":1,"external_links":0,"defined_names":8,"comments":0,"pivot_tables":0},"unopened":[],"bounds":{"document_bytes":16777216,"sheet_cells":100000,"rows_first":2000,"rows_last":500,"rows_between":2000,"halvings":0,"cell_chars":16384,"cell_head_chars":4096},"cells_cut":0,"cells_raw":0,"read":"whole","date_system":"1900"}

{"sheet":"INSTRUCTIONS","index":0,"n_rows":50,"n_cols":3,"rows_kept":50,"cut":false,"hidden":false,"merged":[[8,1,8,13],[37,1,37,13],[44,1,47,13],[49,1,49,13],[40,1,43,11],[39,1,39,13],[48,1,48,13],[26,2,27,13],[50,1,50,13],[29,2,31,13],[1,1,1,13],[2,1,2,13],[36,1,36,13],[33,1,34,13],[11,1,12,1],[11,2,12,13],[14,2,15,13],[14,1,15,1],[17,2,18,13],[17,1,18,1],[20,2,21,13],[20,1,21,1],[23,2,24,13],[23,1,24,1]]}
["\n\n\n"]
[null,"Part C Child Count and Settings Data Tool"]
[null,"The Part C Child Count and Settings Data Tool is designed to be used by states as they prepare "]
[null,"their data for submission via EMAPS. The tool can identify potential format errors, validation"]
[null,"errors, and other errors in subtotals or totals. "]
[]
[null,"Data cannot be submitted using this tool. All data must be submitted following the "]
[null,"guidelines provided in the EMAPS IDEA Part C Child Count and Settings User Guide at:"]
[null,"https://www2.ed.gov/about/inits/ed/edfacts/emaps-idea-part-c-child-count-user-guide.pdf"]
[]
{"$rows_left_out":41}
{"sheet":"Section A-CC & Settings by Age","index":1,"n_rows":50,"n_cols":38,"rows_kept":50,"cut":false,"hidden":false,"merged":[[40,7,41,7],[34,9,35,9],[37,9,38,9],[40,9,41,9],[46,12,48,21],[36,12,39,21],[40,12,42,21],[43,12,45,21],[34,10,35,10],[37,10,38,10],[40,10,41,10],[6,12,8,21],[5,12,5,21],[9,12,9,21],[14,12,17,21],[34,1,35,1],[34,3,35,3],[34,7,35,7],[30,12,30,21],[31,12,32,21],[33,12,33,21],[34,12,34,21],[35,12,35,21],[18,12,20,21],[13,12,13,21],[10,12,10,21],[11,12,11,21],[12,12,12,21],[9,10,10,10],[12,10,13,10],[15,1,16,1],[15,2,16,2],[15,3,16,3],[15,5,16,5],[15,7,16,7],[15,10,16,10],[15,9,16,9],[12,5,13,5],[12,7,13,7],[12,9,13,9],[9,9,10,9],[9,5,10,5],[9,7,10,7],[9,1,10,1],[9,2,10,2],[9,3,10,3],[12,1,13,1],[12,2,13,2],[12,3,13,3],[49,12,49,21],[21,12,23,21],[24,12,24,21],[25,12,27,21],[21,1,21,7],[37,1,38,1],[40,1,41,1],[34,2,35,2],[37,2,38,2],[40,2,41,2],[37,3,38,3],[40,3,41,3],[34,5,35,5],[37,5,38,5],[40,5,41,5],[37,7,38,7]]}
[]
["   Section A: Child Count and Settings by Age",null,null,null,null,null,null,null,null,null,null,null,null,null,null,null,null,null,null,null,null,null,null,null,null,null,null,"Formulas for check date,\"M\",\"NA\",special characters,\"-\""]
[null,null,null,null,null,null,null,"Date",null,null,null,null,null,null,null,null,null,null,null,null,null,null,null,null,null,null,null,"2022-10-01","2022-12-01"]
[null,"What is your state's Child Count date (MM/DD/YYYY)?",null,null,null,null,null,null,null,null,null,null,null,null,null,null,null,null,null,null,null,null,null,null,null,null,null,{"$f":"AND(TEXT(H4,\"mm/dd\")>=(TEXT(AB3,\"mm/dd\")),TEXT(H4,\"mm/dd\")<=(TEXT(AC3,\"mm/dd\")))","v":false}]
[null,null,null,null,null,null,null,null,null,null,null,null,null,null,null,null,null,null,null,null,null,null,null,null,null,null,null,null,null,null,null,null,"Formulas for Individual Settings Error",null,{"$f":"IF(AI6&AI7&AI8=\"\",\"[PartC-CC036a], [PartC-CC036b], [PartC-CC036c]\",\"\")","v":"[PartC-CC036a], [PartC-CC036b], [PartC-CC036c]"}]
[null,"A1. Age Group and Setting of Infants and Toddlers, Ages Birth through 2",null,null,null,null,null,null,null,null,null,null,"ERROR MESSAGES FOR SECTION A1",null,null,null,null,null,null,null,null,null,null,null,null,null,null,{"$f":"IF(SUMPRODUCT(--ISNUMBER(FIND({\"-\",\"/\",\"(\",\")\",\"<\",\">\",\"?\",\"!\",\"@\",\"#\",\"$\",\"%\",\"&\",\"*\"},D10)))>0,1,0)","v":0},{"$f":"IF(OR(D10=\"M\",D13=\"M\", D16=\"M\",F10=\"M\",F13=\"M\",F16=\"M\",H10=\"M\",H13=\"M\",H16=\"M\"),1,0)","v":0},{"$f":"IF(ISNUMBER(FIND(\".\",D10)),1,0)","v":0},{"$f":"IF(OR(D10=\"NA\",D13=\"NA\", D16=\"NA\",F10=\"NA\",F13=\"NA\",F16=\"NA\",H10=\"NA\",H13=\"NA\",H16=\"NA\"),1,0)","v":0},{"$f":"IF(AND(ISTEXT(D10),D10<>\"M\",D10<>\"NA\"),1,0)","v":0},"Home",{"$f":"IFERROR(IF(D19<>'Section B-CC & Settings by RE'!D21,\"Home\",\"\"),\"\")","v":""},{"$f":"IF(AH6=\"\",\"\",\"[PartC-CC036a]\")","v":""},null,{"$f":"IF(AH6=\"\",\"\",AH6&\" and \")","v":""}]
[null,null,null,null,null,null,null,null,null,null,null,null,"DIRECTIONS: If any error message below is highlighted, please read the message and correct the error in the data entry cells, if necessary.",null,null,null,null,null,null,null,null,null,null,null,null,null,null,{"$f":"IF(SUMPRODUCT(--ISNUMBER(FIND({\"-\",\"/\",\"(\",\")\",\"<\",\">\",\"?\",\"!\",\"@\",\"#\",\"$\",\"%\",\"&\",\"*\"},D13)))>0,1,0)","v":0},null,{"$f":"IF(ISNUMBER(FIND(\".\",D13)),1,0)","v":0},null,{"$f":"IF(AND(ISTEXT(D13),D13<>\"M\",D13<>\"NA\"),1,0)","v":0},"Community-based",{"$f":"IFERROR(IF(F19<>'Section B-CC & Settings by RE'!F21,\"Community-Based\",\"\"),\"\")","v":""},{"$f":"IF(AH7=\"\",\"\",\"[PartC-CC036b]\")","v":""},null,{"$f":"IF(AH7=\"\",\"\",AH7&\" and \")","v":""}]
[null,null,null,null,null,"Community-",null,null,null,null,null,null,null,null,null,null,null,null,null,null,null,null,null,null,null,null,null,{"$f":"IF(SUMPRODUCT(--ISNUMBER(FIND({\"-\",\"/\",\"(\",\")\",\"<\",\">\",\"?\",\"!\",\"@\",\"#\",\"$\",\"%\",\"&\",\"*\"},D16)))>0,1,0)","v":0},null,{"$f":"IF(ISNUMBER(FIND(\".\",D16)),1,0)","v":0},null,{"$f":"IF(AND(ISTEXT(D16),D16<>\"M\",D16<>\"NA\"),1,0)","v":0},"Other",{"$f":"IFERROR(IF(H19<>'Section B-CC & Settings by RE'!H21,\"Other\",\"\"),\"\")","v":""},{"$f":"IF(AH8=\"\",\"\",\"[PartC-CC036c]\")","v":""}]
[null,null,null,"Home",null,"Based Setting",null,"Other Setting",null,"Total","Percentage",null,null,null,null,null,null,null,null,null,null,null,null,null,null,null,null,{"$f":"IF(SUMPRODUCT(--ISNUMBER(FIND({\"-\",\"/\",\"(\",\")\",\"<\",\">\",\"?\",\"!\",\"@\",\"#\",\"$\",\"%\",\"&\",\"*\"},F10)))>0,1,0)","v":0},null,{"$f":"IF(ISNUMBER(FIND(\".\",F10)),1,0)","v":0},null,{"$f":"IF(AND(ISTEXT(F10),F10<>\"M\",F10<>\"NA\"),1,0)","v":0},null,{"$f":"COUNTIF(AH6:AH8,\"\")","v":3},{"$f":"IF(AH9=3,\"____\",\"\")","v":"____"},{"$f":"IF(AH9=2,AH6&AH7&AH8,\"\")","v":""},{"$f":"IF(AND(AH9=1,AH8=\"\"),AK6&AH7,IF(AND(AH9=1,AH7=\"\"),AK6&AH8,IF(AND(AH9=1,AK7=\"\"),AK7&AH8,\"\")))","v":""},{"$f":"IF(AH9=0,\"Home, Community-Based, and Other\",\"\")","v":""}]
[null,"1."," Birth to 1",null,null,null,null,null,null,{"$f":"IF(OR(D10=\"\",F10=\"\",H10=\"\"),\"\",IFERROR(SUM(SUBSTITUTE(SUBSTITUTE(LOWER(D10),\"m\",0),\"M\",0)+SUBSTITUTE(SUBSTITUTE(LOWER(F10),\"m\",0),\"M\",0)+SUBSTITUTE(SUBSTITUTE(LOWER(H10),\"m\",0),\"M\",0)),\"ERROR\"))","v":""},{"$f":"IFERROR(J10/$J$19,\"\")","v":""},"X","•  The reported Child Count date does not fall between October 1 and December 1, inclusive of those dates. [PartC-CC001]",null,null,null,null,null,null,null,null,null,null,null,null,null,null,{"$f":"IF(SUMPRODUCT(--ISNUMBER(FIND({\"-\",\"/\",\"(\",\")\",\"<\",\">\",\"?\",\"!\",\"@\",\"#\",\"$\",\"%\",\"&\",\"*\"},F13)))>0,1,0)","v":0},null,{"$f":"IF(ISNUMBER(FIND(\".\",F13)),1,0)","v":0},null,{"$f":"IF(AND(ISTEXT(F13),F13<>\"M\",F13<>\"NA\"),1,0)","v":0},null,null,{"$f":"AI9&AJ9&AK9&AL9","v":"____"}]
{"$rows_left_out":41}
{"sheet":"Section B-CC & Settings by RE","index":2,"n_rows":48,"n_cols":48,"rows_kept":48,"cut":false,"hidden":false,"merged":[[34,12,36,21],[9,12,9,21],[10,12,10,21],[11,12,11,21],[12,12,12,21],[14,12,16,21],[33,12,33,21],[32,12,32,21],[30,12,30,21],[31,12,31,21],[5,12,5,21],[6,12,8,21],[13,12,13,21],[27,12,27,21],[28,12,29,21]]}
[]
["   Section B: Child Count and Settings by Race/Ethnicity"]
[]
[null,"B1. Race/Ethnicity of Infants and Toddlers, Ages Birth through 2"]
[]
[null,null,null,"Home",null,"Community-Based Setting",null,"Other Setting",null,"Total","Percentage",null,"ERROR MESSAGES FOR SECTION B1"]
[null,"1."," Hispanic/Latino",null,null,null,null,null,null,{"$f":"IF(OR(D7=\"\",F7=\"\",H7=\"\"),\"\",IFERROR(SUM(SUBSTITUTE(SUBSTITUTE(LOWER(D7),\"m\",0),\"M\",0)+SUBSTITUTE(SUBSTITUTE(LOWER(F7),\"m\",0),\"M\",0)+SUBSTITUTE(SUBSTITUTE(LOWER(H7),\"m\",0),\"M\",0)),\"ERROR\"))","v":""},{"$f":"IFERROR(J7/$J$21,\"\")","v":""},null,"DIRECTIONS: If any error message below is highlighted, please read the message and correct the error in the data entry cells, if necessary."]
[null,null,null,null,null,null,null,null,null,null,null,null,null,null,null,null,null,null,null,null,null,null,null,null,null,null,null,null,"HOME",null,"CB",null,"OTHER",null,"HOME",null,"CB",null,"OTHER",null,{"$f":"IF(OR(D7=\"M\",D9=\"M\", D11=\"M\",D13=\"M\",D15=\"M\",D17=\"M\",D19=\"M\",F7=\"M\", F9=\"M\",F11=\"M\",F13=\"M\",F15=\"M\",F17=\"M\",F19=\"M\",H7=\"M\",H9=\"M\",H11=\"M\",H13=\"M\",H15=\"M\",H17=\"M\",H19=\"M\"),1,0)","v":0},null,"HOME",null,"CB",null,"OTHER"]
[null,"2."," American Indian or Alaska Native",null,null,null,null,null,null,{"$f":"IF(OR(D9=\"\",F9=\"\",H9=\"\"),\"\",IFERROR(SUM(SUBSTITUTE(SUBSTITUTE(LOWER(D9),\"m\",0),\"M\",0)+SUBSTITUTE(SUBSTITUTE(LOWER(F9),\"m\",0),\"M\",0)+SUBSTITUTE(SUBSTITUTE(LOWER(H9),\"m\",0),\"M\",0)),\"ERROR\"))","v":""},{"$f":"IFERROR(J9/$J$21,\"\")","v":""},null,null,null,null,null,null,null,null,null,null,null,null,null,null,null,null," Hispanic/Latino",{"$f":"IF(SUMPRODUCT(--ISNUMBER(FIND({\"-\",\"/\",\"(\",\")\",\"<\",\">\",\"?\",\"!\",\"@\",\"#\",\"$\",\"%\",\"&\",\"*\"},D7)))>0,1,0)","v":0},null,{"$f":"IF(SUMPRODUCT(--ISNUMBER(FIND({\"-\",\"/\",\"(\",\")\",\"<\",\">\",\"?\",\"!\",\"@\",\"#\",\"$\",\"%\",\"&\",\"*\"},F7)))>0,1,0)","v":0},null,{"$f":"IF(SUMPRODUCT(--ISNUMBER(FIND({\"-\",\"/\",\"(\",\")\",\"<\",\">\",\"?\",\"!\",\"@\",\"#\",\"$\",\"%\",\"&\",\"*\"},H7)))>0,1,0)","v":0},null,{"$f":"IF(ISNUMBER(FIND(\".\",D7)),1,0)","v":0},null,{"$f":"IF(ISNUMBER(FIND(\".\",F7)),1,0)","v":0},null,0,null,null,null,{"$f":"IF(AND(ISTEXT(D7),D7<>\"M\",D7<>\"NA\"),1,0)","v":0},null,{"$f":"IF(AND(ISTEXT(F7),F7<>\"M\",F7<>\"NA\"),1,0)","v":0},null,0]
[null,null,null,null,null,null,null,null,null,null,null,"X","•  A negative integer is entered into a field. Please enter positive, whole numbers only. [PartC-CC029]",null,null,null,null,null,null,null,null,null,null,null,null,null,null," American Indian or Alaska Native",{"$f":"IF(SUMPRODUCT(--ISNUMBER(FIND({\"-\",\"/\",\"(\",\")\",\"<\",\">\",\"?\",\"!\",\"@\",\"#\",\"$\",\"%\",\"&\",\"*\"},D9)))>0,1,0)","v":0},null,{"$f":"IF(SUMPRODUCT(--ISNUMBER(FIND({\"-\",\"/\",\"(\",\")\",\"<\",\">\",\"?\",\"!\",\"@\",\"#\",\"$\",\"%\",\"&\",\"*\"},F9)))>0,1,0)","v":0},null,{"$f":"IF(SUMPRODUCT(--ISNUMBER(FIND({\"-\",\"/\",\"(\",\")\",\"<\",\">\",\"?\",\"!\",\"@\",\"#\",\"$\",\"%\",\"&\",\"*\"},H9)))>0,1,0)","v":0},null,{"$f":"IF(ISNUMBER(FIND(\".\",D9)),1,0)","v":0},null,{"$f":"IF(ISNUMBER(FIND(\".\",F9)),1,0)","v":0},null,0,null,{"$f":"IF(OR(D7=\"NA\",D9=\"NA\", D11=\"NA\",D13=\"NA\",D15=\"NA\",D17=\"NA\",D19=\"NA\",F7=\"NA\", F9=\"NA\",F11=\"NA\",F13=\"NA\",F15=\"NA\",F17=\"NA\",F19=\"NA\",H7=\"NA\",H9=\"NA\",H11=\"NA\",H13=\"NA\",H15=\"NA\",H17=\"NA\",H19=\"NA\"),1,0)","v":0},null,{"$f":"IF(AND(ISTEXT(D9),D9<>\"M\",D9<>\"NA\"),1,0)","v":0},null,{"$f":"IF(AND(ISTEXT(F9),F9<>\"M\",F9<>\"NA\"),1,0)","v":0},null,0]
{"$rows_left_out":39}
{"sheet":"Section C-Child Count by Gender","index":3,"n_rows":29,"n_cols":30,"rows_kept":29,"cut":false,"hidden":false,"merged":[[28,9,30,18],[22,9,24,18],[25,9,27,18],[11,9,11,18],[12,9,13,18],[14,9,15,18],[19,9,19,18],[17,9,18,18],[16,9,16,18],[20,9,20,18],[21,9,21,18],[3,9,3,18],[4,9,6,18],[10,9,10,18],[7,9,7,18],[8,9,8,18],[9,9,9,18]]}
[]
["   Section C: Child Count by Gender"]
[]
[null,"C1. Gender of Infants and Toddlers, Ages Birth through 2, Receiving Early Intervention Services",null,null,null,null,null,null,null,"ERROR MESSAGES FOR SECTION C1"]
[null,null,null,null,null,null,null,null,null,"DIRECTIONS: If any error message below is highlighted, please read the message and correct the error in the data entry cells, if necessary."]
[null,"Gender","Total ",null,"Percentage"]
[null,"Male",null,null,{"$f":"IFERROR(IF(AND(C7<>\"\",C9<>\"\"),(C7/C11),\"\"),\"\")","v":""}]
[null,null,null,null,null,null,null,null,"X    ","•  A negative integer is entered into a field. Please enter positive, whole numbers only. [PartC-CC029]",null,null,null,null,null,null,null,null,null,null,null,null,null,"Male",{"$f":"IF(SUMPRODUCT(--ISNUMBER(FIND({\"-\",\"/\",\"(\",\")\",\"<\",\">\",\"?\",\"!\",\"@\",\"#\",\"$\",\"%\",\"&\",\"*\"},C7)))>0,1,0)","v":0},null,{"$f":"IF(ISNUMBER(FIND(\".\",C7)),1,0)","v":0},null,{"$f":"IF(OR(C7=\"M\",C9=\"M\"),1,0)","v":0},{"$f":"IF(AND(ISTEXT(C7),C7<>\"M\",C7<>\"NA\"),1,0)","v":0}]
[null,"Female",null,null,{"$f":"IFERROR(IF(AND(C7<>\"\",C9<>\"\"),(C9/C11),\"\"),\"\")","v":""},null,null,null,"X    ","•  A number containing a decimal is entered into a field. Please enter whole numbers only. [PartC-CC029]",null,null,null,null,null,null,null,null,null,null,null,null,null,"Female",{"$f":"IF(SUMPRODUCT(--ISNUMBER(FIND({\"-\",\"/\",\"(\",\")\",\"<\",\">\",\"?\",\"!\",\"@\",\"#\",\"$\",\"%\",\"&\",\"*\"},C9)))>0,1,0)","v":0},null,{"$f":"IF(ISNUMBER(FIND(\".\",C9)),1,0)","v":0},null,{"$f":"IF(OR(C7=\"NA\",C9=\"NA\"),1,0)","v":0},{"$f":"IF(AND(ISTEXT(C9),C9<>\"M\",C9<>\"NA\"),1,0)","v":0}]
[null,null,null,null,null,null,null,null,"X    ","•  A special character or a letter is entered in a field. Please enter only whole numbers or \"M\" for Missing. [PartC-CC029]",null,null,null,null,null,null,null,null,null,null,null,null,null,null,{"$f":"SUM(Y8:Y9)","v":0},null,{"$f":"SUM(AA8:AA9)","v":0},null,{"$f":"IF(OR(C11=\"\",'Section A-CC & Settings by Age'!J19=\"\"),\"\",C11='Section A-CC & Settings by Age'!J19)","v":""},{"$f":"SUM(AD8:AD9)","v":0}]
{"$rows_left_out":20}
{"sheet":"Section D-At Risk Child Count","index":4,"n_rows":29,"n_cols":38,"rows_kept":29,"cut":false,"hidden":false,"merged":[[16,15,18,26],[19,15,20,26],[21,15,23,26],[3,1,3,10],[10,15,10,26],[11,15,12,26],[13,15,13,26],[14,15,14,26],[15,15,15,26]]}
[]
["   Section D: At Risk Child Count"]
[]
[null,"Has your state elected under 20 U.S.C. 1432(5)(B)(i) to serve children under the age of three and at risk of having substantial delays if early intervention services are not provided?"]
[]
[]
[]
[]
[]
[null,"At Risk Infants and Toddlers, Ages Birth through 2 (these infants and toddlers should be included in the counts for Sections A1 and B1)"]
{"$rows_left_out":20}
{"sheet":"Section E-Cumulative CC","index":5,"n_rows":37,"n_cols":36,"rows_kept":37,"cut":false,"hidden":false,"merged":[[7,8,7,19],[6,8,6,19],[12,8,12,19],[14,8,14,19],[15,8,15,19],[19,8,21,19],[22,8,23,19],[16,8,16,19],[9,8,9,19],[10,8,11,19],[13,8,13,19],[17,8,18,19]]}
[null,null,null,null,null,null,null,null,null,null,null,null,null,null,null,null,null,null,null,null,null,null,null,null,null,null,null,"Current Date",null,"Current Year",null,"Prior Y1","Prior Y2","Prior Y3"]
["   Section E: Cumulative Child Count by Race/Ethnicity and Gender",null,null,null,null,null,null,null,null,null,null,null,null,null,null,null,null,null,null,null,null,null,null,null,null,null,null,{"$f":"TODAY()","v":"2023-05-30"},null,{"$f":"YEAR(TODAY())","v":2023},null,{"$f":"YEAR(TODAY())-1","v":2022},{"$f":"YEAR(TODAY())-2","v":2021},{"$f":"YEAR(TODAY())-3","v":2020},null,{"$f":"IF(AND(YEAR(C8)>=AH2,YEAR(C8)<=AD2,YEAR(E8)>=AH2,YEAR(E8)<=AD2), \"Within range\", \"Outside range\")","v":"Outside range"}]
[]
["   Cumulative Number of Infants and Toddlers Who Received Early Intervention Services",null,null,null,null,null,null,null,null,null,null,null,null,null,null,null,null,null,null,null,null,null,null,null,null,null,null,"364 or 365 days?"]
[null,null,null,null,null,null,null,null,null,null,null,null,null,null,null,null,null,null,null,null,null,null,null,null,null,{"$f":"IF(C8=\"\",\"\",EDATE(C8,12)-1)","v":""},null,{"$f":"E8-C8","v":0}]
["   Enter the start (From) and end (To) dates for your state's 12-month cumulative count period in the mm/dd/yyyy format.",null,null,null,null,null,null,null,null,null,null,null,null,null,null,null,null,null,null,null,null,null,null,null,null,{"$f":"E8-Z5","v":{"$error":"#VALUE!"}}]
[null,null,null,null,null,null,null,null,"Cumulative \"To\" date cannot exceed the date of last Wednesday in June of the reporting year."]
[null,"  From:",null,"  To:",null,null,null,null,"The \"from\" date must be less than the \"to\" date."]
[]
[null,"E1. "," Cumulative Count of Infants and Toddlers, Ages Birth through 2, by Race/Ethnicity",null,null,null,null,null,"ERROR MESSAGES FOR SECTION E1 AND E2"]
{"$rows_left_out":28}
{"sheet":"Year-to-Year Change","index":6,"n_rows":31,"n_cols":6,"rows_kept":31,"cut":false,"hidden":false,"merged":[[2,1,2,5]]}
[]
[null,"Year-to-Year Change "]
[null,"Directions: To compare the data currently entered in this data tool to the prior year data for your state, either manually type in the prior year child count data or copy/paste the prior year data from the comparison report available in EMAPS--the report named \"[state name] IDEA Part C Child Count andd Settings 20[xx]-[xx]\"."]
[null,null,"Child Count","Child Count"]
[null,"Section","Prior Year","Current Year","Difference","% Change"]
[null,"Section A - Birth through 2 Total by Home",null,{"$f":"'Section A-CC & Settings by Age'!D19","v":""},{"$f":"IF(OR(C6=\"\",D6=\"\"),\"\",D6-C6)","v":""},{"$f":"IFERROR((D6-C6)/C6,\"\")","v":""}]
[null,"Section A - Birth through 2 Total by Community",null,{"$f":"'Section A-CC & Settings by Age'!F19","v":""},"",""]
[null,"Section A - Birth through 2 Total by Other Setting",null,{"$f":"'Section A-CC & Settings by Age'!H19","v":""},"",""]
[null,"Section A - 3 and Older Total by Home",null,{"$f":"'Section A-CC & Settings by Age'!D44","v":""},"",""]
[null,"Section A - 3 and Older Total by Community",null,{"$f":"'Section A-CC & Settings by Age'!F44","v":""},"",""]
{"$rows_left_out":22}
{"sheet":"Failed Edit Checks and Warnings","index":7,"n_rows":58,"n_cols":28,"rows_kept":58,"cut":false,"hidden":true,"merged":[]}
[]
["    From pages 29 and 30 of the February 2022 version of the EMAPS User Guide for this data submission.",null,null,null,null,null,null,null,null,null,null,"Section A",null,null,null,null,"Section B",null,null,null,null,"Section C",null,null,"Section D",null,"Section E"]
["    https://www2.ed.gov/about/inits/ed/edfacts/emaps-idea-part-c-child-count-user-guide.pdf",null,null,null,null,null,null,null,null,null,null,{"$f":"IF(ISBLANK('Section A-CC & Settings by Age'!D10),1,0)","v":1},{"$f":"IF(ISBLANK('Section A-CC & Settings by Age'!F10),1,0)","v":1},{"$f":"IF(ISBLANK('Section A-CC & Settings by Age'!H10),1,0)","v":1},null,null,{"$f":"IF(ISBLANK('Section B-CC & Settings by RE'!D7),1,0)","v":1},{"$f":"IF(ISBLANK('Section B-CC & Settings by RE'!F7),1,0)","v":1},{"$f":"IF(ISBLANK('Section B-CC & Settings by RE'!H7),1,0)","v":1},null,null,{"$f":"IF(ISBLANK('Section C-Child Count by Gender'!C7),1,0)","v":1},null,null,{"$f":"IF(ISBLANK('Section D-At Risk Child Count'!D13),1,0)","v":1},null,{"$f":"IF(ISBLANK('Section E-Cumulative CC'!E13),1,0)","v":1}]
[null,null,null,null,null,null,null,null,null,null,null,{"$f":"IF(ISBLANK('Section A-CC & Settings by Age'!D13),1,0)","v":1},{"$f":"IF(ISBLANK('Section A-CC & Settings by Age'!F13),1,0)","v":1},{"$f":"IF(ISBLANK('Section A-CC & Settings by Age'!H13),1,0)","v":1},null,null,{"$f":"IF(ISBLANK('Section B-CC & Settings by RE'!D9),1,0)","v":1},{"$f":"IF(ISBLANK('Section B-CC & Settings by RE'!F9),1,0)","v":1},{"$f":"IF(ISBLANK('Section B-CC & Settings by RE'!H9),1,0)","v":1},null,null,{"$f":"IF(ISBLANK('Section C-Child Count by Gender'!C9),1,0)","v":1},null,null,{"$f":"IF(ISBLANK('Section D-At Risk Child Count'!D15),1,0)","v":1},null,{"$f":"IF(ISBLANK('Section E-Cumulative CC'!E15),1,0)","v":1}]
[null," To complete all the EMAPS edit checks for Part C Child Count and Settings ",null,null,null,null,null,null,null,null,null,{"$f":"IF(ISBLANK('Section A-CC & Settings by Age'!D16),1,0)","v":1},{"$f":"IF(ISBLANK('Section A-CC & Settings by Age'!F16),1,0)","v":1},{"$f":"IF(ISBLANK('Section A-CC & Settings by Age'!H16),1,0)","v":1},"A1",null,{"$f":"IF(ISBLANK('Section B-CC & Settings by RE'!D11),1,0)","v":1},{"$f":"IF(ISBLANK('Section B-CC & Settings by RE'!F11),1,0)","v":1},{"$f":"IF(ISBLANK('Section B-CC & Settings by RE'!H11),1,0)","v":1},null,null,{"$f":"SUM(V3:V4)","v":2},"C1",null,{"$f":"IF(ISBLANK('Section D-At Risk Child Count'!D17),1,0)","v":1},null,{"$f":"IF(ISBLANK('Section E-Cumulative CC'!E17),1,0)","v":1}]
[null,"data entered in this edit check tool, please complete the following checks:",null,null,null,null,null,null,null,null,null,{"$f":"SUM(L3:L5)","v":3},{"$f":"SUM(M3:M5)","v":3},{"$f":"SUM(N3:N5)","v":3},{"$f":"SUM(L6:N6)","v":9},null,{"$f":"IF(ISBLANK('Section B-CC & Settings by RE'!D13),1,0)","v":1},{"$f":"IF(ISBLANK('Section B-CC & Settings by RE'!F13),1,0)","v":1},{"$f":"IF(ISBLANK('Section B-CC & Settings by RE'!H13),1,0)","v":1},null,null,null,null,null,{"$f":"IF(ISBLANK('Section D-At Risk Child Count'!D19),1,0)","v":1},null,{"$f":"IF(ISBLANK('Section E-Cumulative CC'!E19),1,0)","v":1}]
[null,null,null,null,null,null,null,null,null,null,null,null,null,null,null,null,{"$f":"IF(ISBLANK('Section B-CC & Settings by RE'!D15),1,0)","v":1},{"$f":"IF(ISBLANK('Section B-CC & Settings by RE'!F15),1,0)","v":1},{"$f":"IF(ISBLANK('Section B-CC & Settings by RE'!H15),1,0)","v":1},null,null,{"$f":"IF(ISBLANK('Section C-Child Count by Gender'!C20),1,0)","v":1},null,null,{"$f":"IF(ISBLANK('Section D-At Risk Child Count'!D21),1,0)","v":1},null,{"$f":"IF(ISBLANK('Section E-Cumulative CC'!E21),1,0)","v":1}]
[null,"1.  To check for blank cells in all of the required cells in Sections A ",null,null,null,null,null,null,null,null,null,"YES",{"$f":"IF('Section A-CC & Settings by Age'!AC16=TRUE,1,0)","v":1},null,null,null,{"$f":"IF(ISBLANK('Section B-CC & Settings by RE'!D17),1,0)","v":1},{"$f":"IF(ISBLANK('Section B-CC & Settings by RE'!F17),1,0)","v":1},{"$f":"IF(ISBLANK('Section B-CC & Settings by RE'!H17),1,0)","v":1},null,null,{"$f":"IF(ISBLANK('Section C-Child Count by Gender'!C22),1,0)","v":1},null,null,{"$f":"IF(ISBLANK('Section D-At Risk Child Count'!D23),1,0)","v":1},null,{"$f":"IF(ISBLANK('Section E-Cumulative CC'!E23),1,0)","v":1}]
[null,"     through E, click on the \"Click to check for blank cells\" button.",null,null,null,null,null,null,null,null,null,{"$f":"IF(ISBLANK('Section A-CC & Settings by Age'!D35),1,0)","v":1},{"$f":"IF(ISBLANK('Section A-CC & Settings by Age'!F35),1,0)","v":1},{"$f":"IF(ISBLANK('Section A-CC & Settings by Age'!H35),1,0)","v":1},null,null,{"$f":"IF(ISBLANK('Section B-CC & Settings by RE'!D19),1,0)","v":1},{"$f":"IF(ISBLANK('Section B-CC & Settings by RE'!F19),1,0)","v":1},{"$f":"IF(ISBLANK('Section B-CC & Settings by RE'!H19),1,0)","v":1},"B1",null,{"$f":"SUM(V7:V8)","v":2},"C2",null,{"$f":"IF(ISBLANK('Section D-At Risk Child Count'!D25),1,0)","v":1},null,{"$f":"IF(ISBLANK('Section E-Cumulative CC'!E25),1,0)","v":1}]
[null,null,null,null,null,null,null,null,null,null,null,{"$f":"IF(ISBLANK('Section A-CC & Settings by Age'!D38),1,0)","v":1},{"$f":"IF(ISBLANK('Section A-CC & Settings by Age'!F38),1,0)","v":1},{"$f":"IF(ISBLANK('Section A-CC & Settings by Age'!H38),1,0)","v":1},null,null,{"$f":"SUM(Q3:Q9)","v":7},{"$f":"SUM(R3:R9)","v":7},{"$f":"SUM(S3:S9)","v":7},{"$f":"SUM(Q10:S10)","v":21},null,null,null,null,{"$f":"SUM(Y3:Y9)","v":7},"D",{"$f":"SUM(AA3:AA9)","v":7},"E1"]
{"$rows_left_out":48}